Project

General

Profile

Bug #41306

Updated by Tatjana Dehler 10 months ago

http://pulpito.ceph.com/tdehler-2019-08-15_07:04:09-rados:mgr-wip-tdehler-testing-29614-distro-basic-mira/

<pre>
2019-08-16T06:13:31.127 INFO:tasks.cephfs_test_runner:======================================================================
2019-08-16T06:13:31.127 INFO:tasks.cephfs_test_runner:FAIL: test_create_get_update_delete_w_tenant (tasks.mgr.dashboard.test_rgw.RgwBucketTest)
2019-08-16T06:13:31.127 INFO:tasks.cephfs_test_runner:----------------------------------------------------------------------
2019-08-16T06:13:31.127 INFO:tasks.cephfs_test_runner:Traceback (most recent call last):
2019-08-16T06:13:31.128 INFO:tasks.cephfs_test_runner: File "/home/teuthworker/src/git.ceph.com_ceph-c_wip-tdehler-testing-29614/qa/tasks/mgr/dashboard/test_rgw.py", line 250, in test_create_get_update_delete_w_tenant
2019-08-16T06:13:31.128 INFO:tasks.cephfs_test_runner: self.assertIn('owner', data)
2019-08-16T06:13:31.128 INFO:tasks.cephfs_test_runner:AssertionError: 'owner' not found in u''
2019-08-16T06:13:31.128 INFO:tasks.cephfs_test_runner:
2019-08-16T06:13:31.128 INFO:tasks.cephfs_test_runner:----------------------------------------------------------------------
2019-08-16T06:13:31.129 INFO:tasks.cephfs_test_runner:Ran 71 tests in 997.305s
2019-08-16T06:13:31.129 INFO:tasks.cephfs_test_runner:
2019-08-16T06:13:31.129 INFO:tasks.cephfs_test_runner:FAILED (failures=1)
2019-08-16T06:13:31.129 INFO:tasks.cephfs_test_runner:
2019-08-16T06:13:31.130 INFO:tasks.cephfs_test_runner:======================================================================
2019-08-16T06:13:31.130 INFO:tasks.cephfs_test_runner:FAIL: test_create_get_update_delete_w_tenant (tasks.mgr.dashboard.test_rgw.RgwBucketTest)
2019-08-16T06:13:31.130 INFO:tasks.cephfs_test_runner:----------------------------------------------------------------------
2019-08-16T06:13:31.130 INFO:tasks.cephfs_test_runner:Traceback (most recent call last):
2019-08-16T06:13:31.130 INFO:tasks.cephfs_test_runner: File "/home/teuthworker/src/git.ceph.com_ceph-c_wip-tdehler-testing-29614/qa/tasks/mgr/dashboard/test_rgw.py", line 250, in test_create_get_update_delete_w_tenant
2019-08-16T06:13:31.130 INFO:tasks.cephfs_test_runner: self.assertIn('owner', data)
2019-08-16T06:13:31.131 INFO:tasks.cephfs_test_runner:AssertionError: 'owner' not found in u''
2019-08-16T06:13:31.131 INFO:tasks.cephfs_test_runner:
</pre>

Back