General

Profile

Issues

Filters

Apply Clear

# Project Tracker Status Priority Subject Assignee Updated Category Target version Tags
52909CephBugNewNormalshaman pull fails because of no aarch64 packages being built10/13/2021 10:57 AM
52890teuthologyBugNewNormal lsblk: vg_nvme/lv_4: not a block device10/11/2021 04:51 PM
52889RADOSBugTriagedNormalupgrade tests fails because of missing ceph-volume package10/11/2021 05:19 PM
52846mgrBugNeed More InfoNormaloctopus: mgr fails and freezes while doing pg dump10/11/2021 10:30 PM
52755rgwCleanupNewNormalubuntu 20.04 : rgw warnings09/28/2021 11:23 PM
52754RADOSCleanupNewNormalwindows warnings09/28/2021 11:19 PM
52753RADOSCleanupNewNormalrbd cls : centos 8 warning10/03/2021 02:06 AM
52752RADOSCleanupNewNormalfix warnings09/28/2021 11:20 PM
52742OrchestratorBugNewNormaloctopus: orchestrator._interface.OrchestratorValidationError: name mon.c already in use09/29/2021 01:28 PM
52724RADOSBugNewNormaloctopus: 1/3 mons down, quorum a,c (MON_DOWN)" in cluster log'09/27/2021 07:28 PM
52689DashboardBugTriagedLowdashboard test times out due to health warn: "application not enabled on pool 'dashboard_pool3'"Aashish Sharma09/23/2021 01:23 PMComponent - Pools
52503RADOSBugNewNormalcli_generic.sh: slow ops when trying rand write09/17/2021 10:30 PM
52498RADOSBackportNewNormalnautilus: test tracker: please ignore09/02/2021 09:53 PM
52497RADOSBackportNewNormaloctopus: test tracker: please ignore09/02/2021 09:42 PM
52495RADOSBackportNewNormalpacific: test tracker: please ignore09/02/2021 01:26 PM
52486RADOSBugResolvedNormaltest tracker: please ignore09/27/2021 07:15 AM
52474RADOSBackportResolvedNormalnautilus: test tracker08/31/2021 09:40 PM
52466RADOSBackportResolvedNormalpacific: test tracker08/31/2021 09:40 PM
52447DashboardBugResolvedNormalhost not added back: should delete a host and add it back09/07/2021 10:43 AM
52421RADOSBugResolvedNormaltest tracker09/06/2021 04:18 PM3
52419sepiaBugClosedLowtest tracker08/26/2021 06:09 PM
52337RADOSBackportResolvedNormaloctopus: ceph df detail reports dirty objects without a cache tierDeepika Upadhyay09/20/2021 04:21 PMCeph - v15.2.15
52336RADOSBackportResolvedNormalpacific: ceph df detail reports dirty objects without a cache tier09/06/2021 04:04 PMCeph - v16.2.6
52335RADOSBugResolvedNormalceph df detail reports dirty objects without a cache tier09/20/2021 04:24 PM
52318teuthologyBugResolvedNormalerror parsing raw_yaml while generating job configDeepika Upadhyay08/19/2021 02:13 PM
52257teuthologyBugClosedNormalpulpito reporting running status even after jobs are finished09/20/2021 02:48 PM
52237OrchestratorFeatureClosedLowuse cephadm shell to operate iscsi gateway10/01/2021 09:30 AMcephadm/rbd
51931teuthologyTasksNewNormalimprove failure logging07/28/2021 05:39 PMlow-hanging-fruit, good-first-issue
51907CIFeatureNewNormalgithub action for ceph backports07/28/2021 04:29 PM
51858RADOSBugNewNormaloctopus: rados/test_crash.sh failure07/30/2021 11:10 PM
51828teuthologyBugNewNormalflavor supplied from distro, overrides with default version after first loop07/23/2021 10:57 AM
51788InfrastructureBugNewNormalrhel 8.3 cannot download: x86_64/catatonit-0.1.5-6.el8.3.8.x86_64.rpm07/21/2021 07:59 PM
51773DashboardBugResolvedNormalFAIL: test_health_permissions (tasks.mgr.dashboard.test_health.HealthTest)07/22/2021 05:58 AM
51742sepiaBugNewNormalError: Failed to download metadata for repo 'appstream'07/20/2021 03:18 PM
51537CephFeatureNewNormaluse git `Prepare Commit Message` hook to add component in commit title07/15/2021 05:45 PMlow-hanging-fruit
51523RADOSBackportResolvedNormaloctopus: osd: Delay sending info to new backfill peer resetting last_backfill until backfill actually starts09/22/2021 10:32 PM
51522RADOSBackportResolvedNormalpacific: osd: Delay sending info to new backfill peer resetting last_backfill until backfill actually starts07/05/2021 11:46 AM
51439rbdBugNewNormalrbd_fio_test: remote process result: None 06/30/2021 04:43 PM
51438rbdBugPending BackportNormal[pwl] possible data corruption in TEST_F(TestLibRBD, TestFUA)jianpeng ma09/13/2021 09:51 AM
51269RADOSBackportResolvedNormaloctopus: rados/perf: cosbench workloads hang foreverDeepika Upadhyay06/29/2021 07:56 AMCeph - v15.2.14
51246RADOSBugNewNormalerror in open_pools_parallel: rados_write(0.obj) failed with error: -207/28/2021 12:48 PM
51245OrchestratorBugNewNormaloctopus: cephadm/focal: E: The repository 'https://download.ceph.com/debian-15.1.1 focal Release' does not have a Release file06/17/2021 09:01 PM
51242mgrBackportNewNormaloctopus: mgr module fails in focal, due to ceph-mgr-rook module06/16/2021 07:27 AM
51241mgrBackportResolvedNormalpacific: mgr module fails in focal, due to ceph-mgr-rook moduleLaura Paduano09/06/2021 04:03 PMCeph - v16.2.6
51240mgrBugPending BackportHighmgr module fails in focal, due to ceph-mgr-rook module06/16/2021 07:26 AMceph-mgr
51175sepiaBugNewNormaloctopus: user = list(self.cluster.remotes)[0].user IndexError: list index out of range 06/18/2021 10:21 AM
51044rbdBugResolvedNormallibrbd::cache::pwl::rwl::WriteLog failed to initialize poolDeepika Upadhyay06/01/2021 05:35 PM
50996rbdBackportNewNormaloctopus: "test_notify.py" is timing out in upgrade-clients:client-upgrade-nautilus-pacific-pacific05/27/2021 09:53 AM
50995rbdBackportNewNormalnautilus: "test_notify.py" is timing out in upgrade-clients:client-upgrade-nautilus-pacific-pacific05/27/2021 09:53 AM
50842RADOSBugNeed More InfoNormalpacific: recovery does not complete because of rw_manager lock not being released06/17/2021 08:57 PM
50829RADOSBugNewNormalnautilus: valgrind leak in SimpleMessenger05/21/2021 09:18 PM
50786RADOSBugNewNormalnautilus: UnicodeDecodeError: 'utf8' codec can't decode byte05/14/2021 09:46 PM
50761RADOSBugNewNormalceph mon hangs forever while trying to parse config05/13/2021 03:15 PM
50720sepiaBugResolvedNormalsepia: TLS Error: TLS key negotiation failed to occur within 60 seconds adam kraitman05/27/2021 01:08 PMUser access
50648RADOSBugNewNormalnautilus: ceph status check times out05/07/2021 10:06 PM
50578bluestoreBugDuplicateNormalBlueFS::FileWriter::lock aborts when trying to `--mkfs`05/27/2021 02:25 PM
50575CephBugResolvedNormalceph-osd fails with latest boost 1.7505/12/2021 02:27 PM
50525rbdBugIn ProgressNormalFAILED ] DiffIterateTest/0.DiffIterate, where TypeParam = DiffIterateParams<false>Sunny Kumar07/30/2021 02:57 PM
50376RADOSBugNewNormalupgrade-clients:client-upgrade-octopus-pacific: cluster [WRN] Health check failed: mon is allowing insecure global_id reclaim (AUTH_INSECURE_GLOBAL_ID_RECLAIM_ALLOWED)04/15/2021 06:13 PM
50277RADOSBugNewNormalnautilus: Error ETIMEDOUT: crush smoke test failed with -110: timed out during smoke test (5 seconds)04/16/2021 10:16 PM
50276teuthologyBugNewNormalerror: error renaming temp state file /var/lib/logrotate/logrotate.status.tmp04/09/2021 10:11 PM
50275RADOSBugNewLownautilus: evicting unresponsive client04/09/2021 10:06 PM
50208RADOSBugNewNormal[ FAILED ] CephSQLiteTest.InsertBulk4096 [with slow ops during this test with addtional dispatch delays]Deepika Upadhyay04/10/2021 01:56 AM
50206pulpitoBugNewNormalteuthology doesn't generate scrape.log for some batches04/07/2021 11:13 AM
50197pulpitoBugNewNormalpulpito showing failed job as green04/07/2021 06:47 AM
49832RADOSBugNewNormalSegmentation fault: in thread_name:ms_dispatch03/16/2021 03:46 PM
49777RADOSBugNewNormal'check for active or peered' reached maximum tries (5) after waiting for 25 seconds04/06/2021 07:17 PM
49771InfrastructureBugResolvedNormalceph ansible fails on rhel 7+David Galloway05/20/2021 09:30 PM
49603OrchestratorBugCan't reproduceNormalcephadm/podman: 3 stray daemon(s) not managed by cephadm","count":3}06/08/2021 10:36 AM
49591RADOSBugNewNormalno active mgr (MGR_DOWN)" in cluster log04/22/2021 04:09 PM
49575teuthologyBugNewNormalteuthology command docs: broken links 'teuthology-schedule --help' failed03/02/2021 09:33 PMlow-hanging-fruit
49548InfrastructureBugNewNormalnautilus: Command failed: 'set -ex\nsudo dd of=/home/ubuntu/cephtest/valgrind.supp'06/04/2021 04:10 PM
49293OrchestratorBugRejectedHighpodman 3.0 on ubuntu 18.04: failed to mount overlay for metacopy check with "nodev,metacopy=on" options: invalid argument05/07/2021 08:47 PM
49281teuthologyFeatureNewNormalteuthology automate scheduling runs on completion of package builds02/12/2021 04:14 PM
49212RADOSBugResolvedHighmon/crush_ops.sh fails: Error EBUSY: osd.1 has already bound to class 'ssd', can not reset class to 'hdd'04/02/2021 07:08 AM
48982OrchestratorBugResolvedNormalcephadm: ubuntu_18_04: Error: error creating container storage: the container name02/03/2021 11:52 AM
48981OrchestratorBugResolvedHighcephadm exporter: manager errors out with assertion error Paul Cuzner02/01/2021 10:23 PM
48951OrchestratorBugDuplicateNormalteuthology only collected coredumps, not daemon logs01/29/2021 06:09 PMteuthology
48871RADOSBugNewNormalnautilus: rados/test_crash.sh: "kill ceph-osd" times out01/22/2021 06:46 PM
48845DashboardBugPending BackportNormalOctopus: tasks.ceph_test_case.TestTimeoutError: Timed out after 60 seconds waiting for HEALTH_OK (currently HEALTH_WARN)Ernesto Puerta10/06/2021 07:49 PMGeneral
48840RADOSBugNewNormalOctopus: Assert failure: test_ceph_osd_pool_create_utf801/15/2021 10:33 PMlow-hanging-fruit
48824mgrBugResolvedNormaloctopus: ERROR: test_osd_came_back (tasks.mgr.test_progress.TestProgress)Kamoltat Sirivadhna03/26/2021 09:48 AM
48820teuthologyBugNewNormalteuthology rerun takes wrong sha1 if branch name is not specified01/11/2021 08:54 AM
48764RADOSBugNewNormalOctopus: Radosmodel tests fails when trying DeleteOp::_begin()01/08/2021 10:24 PMTiering
48566RADOSBugResolvedNormalnautilus: qa/standalone/scrub/osd-scrub-test.sh: _scrub_abort: return 1David Zafman04/02/2021 07:09 AM
48549RADOSBugClosedNormalosd timeout in test_osd_came_back 12/10/2020 08:29 PM
48312OrchestratorBugResolvedNormalcompilation fails if earlier version of lua is present11/27/2020 04:12 PM
48263OrchestratorBugWon't FixNormalcephadm: ambigious container name `ceph-00000000-0000-0000-0000-0000deadbeef` being called instead of fsid11/20/2020 10:37 AMcephadm
48204CephBugResolvedNormaladmin socket terminates with std::bad_alloc Brad Hubbard11/16/2020 09:03 PM
48162OrchestratorBugResolvedHighoctopus: all mgr daemons do not support module 'cephadm'Kefu Chai11/12/2020 11:51 PMcephadm
48157OrchestratorBugResolvedUrgenttest_cephadm.sh failure You have reached your pull rate limit. You may increase the limit by authenticating and upgradingDavid Galloway02/04/2021 01:31 PM
48154CephBugNewNormalqa/tasks/ceph_manager failure seen in nautilus11/09/2020 03:20 PM
48141CIBugResolvedNormaljenkins opensuse failure on shaman07/26/2021 08:46 PM
48126CephBugNewNormalshaman: false reporting about build failures11/05/2020 08:09 AMbuild
48105OrchestratorBugCan't reproduceNormalcephadm.py: failure on interactive on error for archive file handling02/11/2021 11:44 AMcephadm
47949RADOSBugNewNormalscrub/osd-scrub-repair.sh: TEST_auto_repair_bluestore_scrub: return 105/07/2021 07:48 PM
47945RADOSBugDuplicateNormalscrubbing failure12/24/2020 05:17 AM
47915CephBackportResolvedNormaloctopus: hammer packages not found on shamanDeepika Upadhyay12/14/2020 12:16 PMCeph - v15.2.8
47779CephBugNewNormalinstall-deps: xmlsec build failure on f3210/07/2020 12:59 PMbuild
47743CephBugDuplicateNormal Error ENXIO: problem getting command descriptions from mon10/05/2020 06:18 AM
(1-100/135) Per page: 25, 50, 100, 500

Also available in: Atom CSV PDF