General

Profile

Issues

Filters

Apply Clear

# Project Tracker Status Priority Subject Assignee Updated Category Target version Tags
50829RADOSBugNewNormalnautilus: valgrind leak in SimpleMessenger05/21/2021 09:18 PM
50786RADOSBugNewNormalnautilus: UnicodeDecodeError: 'utf8' codec can't decode byte05/14/2021 09:46 PM
50761RADOSBugNewNormalceph mon hangs forever while trying to parse config05/13/2021 03:15 PM
50720sepiaBugResolvedNormalsepia: TLS Error: TLS key negotiation failed to occur within 60 seconds adam kraitman05/27/2021 01:08 PMUser access
50648RADOSBugNewNormalnautilus: ceph status check times out05/07/2021 10:06 PM
50578bluestoreBugDuplicateNormalBlueFS::FileWriter::lock aborts when trying to `--mkfs`05/27/2021 02:25 PM
50575CephBugResolvedNormalceph-osd fails with latest boost 1.7505/12/2021 02:27 PM
50525rbdBugIn ProgressNormalFAILED ] DiffIterateTest/0.DiffIterate, where TypeParam = DiffIterateParams<false>Sunny Kumar07/30/2021 02:57 PM
50376RADOSBugNewNormalupgrade-clients:client-upgrade-octopus-pacific: cluster [WRN] Health check failed: mon is allowing insecure global_id reclaim (AUTH_INSECURE_GLOBAL_ID_RECLAIM_ALLOWED)04/15/2021 06:13 PM
50277RADOSBugNewNormalnautilus: Error ETIMEDOUT: crush smoke test failed with -110: timed out during smoke test (5 seconds)04/16/2021 10:16 PM
50276teuthologyBugNewNormalerror: error renaming temp state file /var/lib/logrotate/logrotate.status.tmp04/09/2021 10:11 PM
50275RADOSBugNewLownautilus: evicting unresponsive client04/09/2021 10:06 PM
50208RADOSBugNewNormal[ FAILED ] CephSQLiteTest.InsertBulk4096 [with slow ops during this test with addtional dispatch delays]Deepika Upadhyay04/10/2021 01:56 AM
50206pulpitoBugNewNormalteuthology doesn't generate scrape.log for some batches04/07/2021 11:13 AM
50197pulpitoBugNewNormalpulpito showing failed job as green04/07/2021 06:47 AM
49832RADOSBugNewNormalSegmentation fault: in thread_name:ms_dispatch03/16/2021 03:46 PM
49777RADOSBugNewNormal'check for active or peered' reached maximum tries (5) after waiting for 25 seconds04/06/2021 07:17 PM
49771InfrastructureBugResolvedNormalceph ansible fails on rhel 7+David Galloway05/20/2021 09:30 PM
49603OrchestratorBugCan't reproduceNormalcephadm/podman: 3 stray daemon(s) not managed by cephadm","count":3}06/08/2021 10:36 AM
49591RADOSBugNewNormalno active mgr (MGR_DOWN)" in cluster log04/22/2021 04:09 PM
49575teuthologyBugNewNormalteuthology command docs: broken links 'teuthology-schedule --help' failed03/02/2021 09:33 PMlow-hanging-fruit
49548InfrastructureBugNewNormalnautilus: Command failed: 'set -ex\nsudo dd of=/home/ubuntu/cephtest/valgrind.supp'06/04/2021 04:10 PM
49293OrchestratorBugRejectedHighpodman 3.0 on ubuntu 18.04: failed to mount overlay for metacopy check with "nodev,metacopy=on" options: invalid argument05/07/2021 08:47 PM
49281teuthologyFeatureNewNormalteuthology automate scheduling runs on completion of package builds02/12/2021 04:14 PM
49212RADOSBugResolvedHighmon/crush_ops.sh fails: Error EBUSY: osd.1 has already bound to class 'ssd', can not reset class to 'hdd'04/02/2021 07:08 AM
(51-75/135) Per page: 25, 50, 100, 500

Also available in: Atom CSV PDF