General

Profile

Issues

Filters

Apply Clear

# Project Tracker Status Priority Subject Assignee Updated Category Target version Tags
39593mgrBackportIn ProgressNormalmimic: Cython 0.29 removed support for subinterpreters: raises "ImportError: Interpreter change detected ..."Nathan Cutler05/06/2019 09:04 AM
39592mgrBackportIn ProgressNormalmimic: ceph-mgr: ImportError: Interpreter change detected - this module can only be loaded into one interprer per process.Nathan Cutler05/06/2019 10:03 AM
39590rbdBackportIn ProgressNormalnautilus: qa/tasks/rbd_fio: fixed missing delimiter between 'cd' and 'configure' Nathan Cutler05/07/2019 07:38 AM
39589rbdBackportIn ProgressNormalluminous: qa/tasks/rbd_fio: fixed missing delimiter between 'cd' and 'configure' Nathan Cutler05/07/2019 07:40 AM
39588rgwBugNewNormalradosgw-admin dump 05/13/2019 09:09 PM
39587mgrBugNewNormal[ceph-mgr]High cpu usage05/13/2019 09:10 PMCeph - v13.2.6
39586mgrBugNeed ReviewHighdashboard: orchestrator mgr modules assert failure on iscsi service requestSebastian Wagner05/13/2019 09:53 AMdashboard/iscsi
39584rbdBugPending BackportNormalqa/tasks/rbd_fio: fixed missing delimiter between 'cd' and 'configure' 05/03/2019 05:54 PM
39582RADOSBugPending BackportNormalBinary data in OSD log from "CRC header" messageDavid Zafman05/13/2019 08:08 PM
39581RADOSBugVerifiedHighosd/PG.cc: 2523: FAILED ceph_assert(scrub_queued)05/08/2019 06:04 PM
39580mgrBugNeed ReviewNormalmgr/dashboard: Optimize the calculation of portal IPsRicardo Marques05/13/2019 03:12 PMdashboard/iscsiperformance
39579mgrFixNeed ReviewHighmgr/dashboard: Fix run-tox script to accept cli arguments againNathan Cutler05/03/2019 11:12 AMdashboard/qaCeph - v15.0.0
39578mgrBugPending BackportNormalmgr/dashboard: iSCSI form does not support IPv6Ricardo Marques05/08/2019 12:01 PMdashboard/iscsiCeph - v15.0.0
39577rgwBackportIn ProgressNormalnautilus: build/rgw: unittest_rgw_dmclock_scheduler does not need Boost_LIBRARIES #26799Nathan Cutler05/03/2019 09:45 AM
39576rgwBackportNeed More InfoNormalmimic: build/rgw: unittest_rgw_dmclock_scheduler does not need Boost_LIBRARIES #2679905/03/2019 09:46 AM
39575rgwBackportIn ProgressNormalnautilus: librgw: unexpected crash when creating bucketWei-Chung Cheng05/03/2019 03:22 PM
39574rgwBackportIn ProgressNormalnautilus: rgw: cloud sync module logs attrs in the logWei-Chung Cheng05/03/2019 03:16 PM
39573rbdBackportIn ProgressNormalnautilus: common: Clang requires a default constructor, but it can be empty #27844Jason Dillaman05/15/2019 08:02 PM
39572rgwBackportIn ProgressNormalluminous: send x-amz-version-id header in PUT responseCasey Bodley05/02/2019 08:47 PM
39570CephBugNeed ReviewHighnautilus with requrie_osd_release < nautilus cannot increase pg_numSage Weil05/03/2019 09:21 AM
39569bluestoreBugNewNormalos/bluestore: fix for FreeBSD iocb structure #2745805/02/2019 10:18 PM
39565bluestoreBackportIn ProgressNormalluminous: ceph-bluestore-tool: bluefs-bdev-expand silently bypasses main device (slot 2)Igor Fedotov05/01/2019 10:48 PM
39564rgwBugPending BackportNormalbuild/rgw: unittest_rgw_dmclock_scheduler does not need Boost_LIBRARIES #2679905/03/2019 09:44 AM
39563RADOSBackportIn ProgressNormalluminous: Error message displayed when mon_osd_max_split_count would be exceeded is not as user-friendly as it could beNathan Cutler05/01/2019 04:34 PM
39561rbdBugPending BackportNormalcommon: Clang requires a default constructor, but it can be empty #2784405/01/2019 10:56 PM
39560mgrBackportIn ProgressNormalnautilus: mgr/dashboard: Queue notifications as defaultStephan Müller05/08/2019 01:07 PM
39559mgrBackportIn ProgressNormalnautilus: mgr/ansible: Host ls implementation 05/02/2019 12:39 PM
39558mgrBackportIn ProgressNormalnautilus: mgr/dashboard: KV-table transforms dates through pipeStephan Müller05/08/2019 12:58 PM
39557CephBackportNewNormalcommon: Clang requires a default constructor, but it can be empty #2784405/01/2019 08:58 AM
39556mgrBugVerifiedNormalmgr/dashboard: npm problem causes "make-dist" to fail when directory contains colon character05/10/2019 01:48 PMdashboard/qa
39555RADOSBugNewNormalbackfill_toofull while OSDs are not full (Unneccessary HEALTH_ERR)David Zafman05/21/2019 05:06 PMBackfill/Recovery
39553RADOSBugNewNormalPeeringState: cache PeeringListener indirectionsSamuel Just04/30/2019 11:01 PM
39552RADOSBugNewNormalmons fail to process send_alive message causing pg stuck creating05/01/2019 09:14 PM
39551rgwBugNeed ReviewNormalmultisite: RGWListBucketIndexesCR for data full sync needs paginationShilpa MJ05/16/2019 02:45 PMmultisite admin-api
39550rgwFeatureNewNormal[RFE] RGW renaming a user04/30/2019 06:39 PM
39549rgwBugNewNormalmultisite: admin apis on non-master zone should forward to master zone04/30/2019 06:11 PMmultisite admin-api
39548rgwBugNewNormalmultisite: radosgw-admin commands should not modify metadata on a non-master zone04/30/2019 06:07 PMmultisite
39547rgwBugNewNormalmultisite: metadata consistency on non-master zones04/30/2019 06:04 PMmultisite
39546RADOSBugNewNormalWarning about past_interval bounds on deleting pg05/01/2019 09:14 PM
39545rgwBugNewNormalmultisite: add a metadata handler for roles so they can participate in metadata sync04/30/2019 05:39 PMmultisite sts
39544rbdBugNewNormal[test] numerous memory leaks in unittest_librbd04/30/2019 05:04 PM
39543fsBugNeed ReviewNormaldf command does not always produce correct outputVarsha Rao04/30/2019 08:29 PMCeph - v15.0.0
39542Linux kernel clientFeatureNewNormalceph: cgroup controller for limiting client ops04/30/2019 12:08 PMfs/cephCeph - v15.0.0
39541rbdBackportIn ProgressNormalnautilus: [test] qemu-iotests tests fails under latest Ubuntu kernelNathan Cutler05/07/2019 07:35 AM
39540mgrBackportIn ProgressNormalnautilus: Provide a base set of Prometheus alert manager rules that notify the user about common Ceph error conditionsNathan Cutler05/07/2019 11:26 AM
39539RADOSBackportNewNormalnautilus: osd/ReplicatedBackend.cc: 1321: FAILED assert(get_parent()->get_log().get_log().objects.count(soid) && (get_parent()->get_log().get_log().objects.find(soid)->second->op == pg_log_entry_t::LOST_REVERT) && (get_parent()->get_log().get_log().object04/30/2019 11:36 AM
39538RADOSBackportNewNormalmimic: osd/ReplicatedBackend.cc: 1321: FAILED assert(get_parent()->get_log().get_log().objects.count(soid) && (get_parent()->get_log().get_log().objects.find(soid)->second->op == pg_log_entry_t::LOST_REVERT) && (get_parent()->get_log().get_log().objects.f04/30/2019 11:36 AM
39537RADOSBackportNewNormalluminous: osd/ReplicatedBackend.cc: 1321: FAILED assert(get_parent()->get_log().get_log().objects.count(soid) && (get_parent()->get_log().get_log().objects.find(soid)->second->op == pg_log_entry_t::LOST_REVERT) && (get_parent()->get_log().get_log().object04/30/2019 11:36 AM
39536mgrBackportIn ProgressNormalnautilus: test_orchestrator: AttributeError: 'TestWriteCompletion' object has no attribute 'id'05/02/2019 12:42 PM
39534mgrBackportIn ProgressNormalnautilus: mgr/dashboard: New RBD snapshot names should be prefix with a local time bound ISO timestamp not UTCStephan Müller04/30/2019 12:37 PM
39533mgrBugNewNormalmgr/dashboard: notify the user about unset 'mon_allow_pool_delete' flag beforehandTatjana Dehler04/30/2019 12:03 PMdashboard/usability
39532rgwBackportNewNormalmimic: rgw: resharding of a versioned bucket causes a bucket stats discrepancy04/30/2019 08:29 AM
39531rgwBackportNewNormalluminous: rgw: resharding of a versioned bucket causes a bucket stats discrepancy04/30/2019 08:29 AM
39530mgrBackportIn ProgressNormalnautilus: tox failures when running "make check"Nathan Cutler04/30/2019 08:30 AM
39529bluestoreBugNewNormalbluestore transaction apparently lost on osd restartSage Weil05/13/2019 09:10 PM
39528rgwFeatureNewNormalAdding number of buckets in radosgw-admin user stats command04/29/2019 09:07 PM
39527Ceph-deployBugNeed ReviewHighfix bootstrap failure on python2/centos7.504/29/2019 08:02 PM
39526fsBugPending BackportNormalcephfs-shell: teuthology testsMilind Changire05/14/2019 07:50 PMCeph - v15.0.0
39525RADOSBugNeed More InfoNormalSeveral Bluestore OSDs crashing during startup in OSDMap::decode after taking new OSDs online05/01/2019 10:55 PMCorrectness/Safety
39523Linux kernel clientBugNewNormalsmall write in ab mode does not change mtime04/29/2019 02:10 PM
39522bluestoreDocumentationNewNormalfix and improve doc regarding manual bluestore cache settings.Jan Fajerski05/01/2019 09:17 AM
39521rbdBugPending BackportNormalFast-diff can be disabled w/o disabling object-mapJason Dillaman05/13/2019 12:25 PM
39520RADOSBackportNewNormalluminous: snaps missing in mapper, should be: ca was r -2...repaired04/29/2019 10:23 AM
39519RADOSBackportNewNormalnautilus: snaps missing in mapper, should be: ca was r -2...repaired04/29/2019 10:23 AM
39518RADOSBackportNewNormalmimic: snaps missing in mapper, should be: ca was r -2...repaired04/29/2019 10:23 AM
39517RADOSBackportNewNormalnautilus: Improvements to standalone tests.04/29/2019 10:23 AM
39516RADOSBackportIn ProgressNormalnautilus: osd-backfill-space.sh test failed in TEST_backfill_multi_partial()Prashant D05/21/2019 03:03 AM
39515RADOSBackportNewNormalluminous: osd: segv in _preboot -> heartbeat04/29/2019 10:22 AM
39514RADOSBackportIn ProgressNormalnautilus: osd: segv in _preboot -> heartbeatPrashant D05/20/2019 02:45 AM
39513RADOSBackportNewNormalmimic: osd: segv in _preboot -> heartbeat04/29/2019 10:22 AM
39512RADOSBackportIn ProgressNormalnautilus: osd acting cyclePrashant D05/17/2019 03:13 AM
39511fsBugNeed More InfoNormalCannot remove CephFS snapshot with leading underscore (_)05/13/2019 01:50 PM
39510fsBugNeed ReviewNormaltest_volume_client: test_put_object_versioned is unreliableRishabh Dave05/13/2019 01:47 PMCeph - v15.0.0
39509RADOSBugNeed More InfoNormalsegm fault when invoke MergeOperatorRouter::Name()05/01/2019 09:24 PM
39508mgrBugNewNormalceph-mgr: blocking requests sent to restful module hangs sometimes in luminous 12.2.1104/30/2019 03:38 PM
39507fsBugPending BackportNormalcephfs-shell: mkdir error for relative pathVarsha Rao05/15/2019 10:46 PMAdministration/UsabilityCeph - v15.0.0
39506RADOSBackportNeed More InfoNormalmimic: Give recovery for inactive PGs a higher priorityNeha Ojha05/07/2019 07:30 AM
39505RADOSBackportNeed More InfoNormalluminous: Give recovery for inactive PGs a higher priorityNeha Ojha05/07/2019 07:29 AM
39503rgwBackportIn ProgressNormalnautilus: rgw: clean up some loggingWei-Chung Cheng05/03/2019 03:02 PM
39502mgrBackportIn ProgressNormalnautilus: mgr/dashboard: RGW Bucket API should provide times in UTC that will be converted into local time by AngularAshish Singh04/27/2019 03:33 PM
39501rbdBackportNeed More InfoNormalmimic: snapshot object maps can go inconsistent during copyupNathan Cutler05/17/2019 01:36 PM
39500rbdBackportNeed More InfoNormalluminous: snapshot object maps can go inconsistent during copyupNathan Cutler05/17/2019 01:36 PM
39499rbdBackportNeed More InfoNormalnautilus: snapshot object maps can go inconsistent during copyupNathan Cutler05/17/2019 01:35 PM
39497rgwBackportIn ProgressNormalluminous: rgw admin: object stat command output's delete_at not readableNathan Cutler05/07/2019 07:45 AM
39496rgwBackportIn ProgressNormalnautilus: rgw admin: object stat command output's delete_at not readableAshish Singh04/27/2019 03:39 PM
39495rgwBugPending BackportNormalrgw: swift object expiry fails when a bucket reshardsAbhishek Lekshmanan05/13/2019 01:08 PM
39494mgrFeatureNewNormalmgr/dashboard: Add overview landing page for RGWKanika Murarka04/26/2019 02:05 PMdashboard/rgw
39493mgrFeatureNewLowmgr/dashboard: Future RFE: Integration of Ceph-medic with dashboard04/26/2019 11:50 AMdashboard/general
39491CephFeatureNeed ReviewNormalrdtsc() support for s390x04/30/2019 01:53 AMcommon
39489Ceph-deployBugNewHighUbuntu/Nautilus: TypeError: sequence item 0: expected a bytes-like object, str found04/25/2019 06:51 PM
39488rgwBugNewNormalsse-kms: requests to barbican do not url-encode the kms keyid05/02/2019 05:45 PMeasy first bug
39487rgwBugNeed ReviewNormalrgw multisite: datalogs/bilogs are not trimmed if no peer zones are processing themCasey Bodley04/25/2019 08:45 PMmultisite trim
39486mgrBugNeed ReviewNormaldebian package from source - mgr module enable dashboard: Frontend assets not foundLenz Grimmer05/07/2019 11:22 AMBuildCeph - v14.2.0mgr dashboard build source nautilus debian
39485rgwBugNeed More InfoNormalLuminous: a huge bucket stuck in dynamic resharding for one weekEric Ivancich05/09/2019 05:51 PMrgw
39484RADOSBugPending BackportNormalmon: "FAILED assert(pending_finishers.empty())" when paxos restartGreg Farnum05/10/2019 09:22 PMCorrectness/SafetyCeph - v13.2.5
39482mgrFeatureNeed ReviewNormalmgr/dashboard: Make a long running task out of the increase or decrease of pgs of a poolStephan Müller05/17/2019 02:43 PMdashboard/pools
39481rgwBugPending BackportNormalrgw admin: object stat command output's delete_at not readableAbhishek Lekshmanan04/25/2019 05:41 PM
39479rgwBackportIn ProgressNormalnautilus: test/rgw: fix race in test_rgw_reshard_wait and test_rgw_reshard_wait uses same clock for timingTatjana Dehler04/26/2019 04:00 PM
39478mgrFeatureNewNormalmgr/dashboard: new RGW workflows & RGW enhancementsAlfonso MH04/30/2019 01:11 PMdashboard/rgwCeph - v15.0.0
39477mgrFeatureIn ProgressNormalmgr/dashboard: add/edit missing RGW bucket infoAlfonso MH05/03/2019 01:43 PMCeph - v15.0.0
(201-300/4727) Per page: 25, 50, 100, 500

Also available in: Atom CSV PDF